{"text_format":"1","workbook":"xlsx","n_sheets":3,"sheets":["Game Board","Score Board","System Board"],"not_rendered":{"charts":0,"images":0,"macros":1,"external_links":0,"defined_names":0,"comments":0,"pivot_tables":0},"unopened":[],"bounds":{"document_bytes":16777216,"sheet_cells":100000,"rows_first":2000,"rows_last":500,"rows_between":2000,"halvings":0,"cell_chars":16384,"cell_head_chars":4096},"cells_cut":0,"cells_raw":0,"read":"whole","date_system":"1900"}

{"sheet":"Game Board","index":0,"n_rows":27,"n_cols":30,"rows_kept":27,"cut":false,"hidden":false,"merged":[[6,28,7,28],[8,28,9,28],[4,15,4,16],[4,17,4,18],[4,19,4,20],[18,15,18,16],[18,17,18,18],[18,19,18,20],[3,15,3,20],[5,13,10,13],[13,3,13,8],[12,15,12,20],[11,19,11,20],[5,10,6,10],[26,15,26,20],[5,14,6,14],[7,14,8,14],[9,14,10,14],[5,11,10,11],[7,10,8,10],[9,10,10,10],[19,13,24,13],[19,14,20,14],[21,14,22,14],[23,14,24,14],[17,15,17,20],[5,0,10,0],[5,1,6,1],[12,3,12,4],[12,5,12,6],[12,7,12,8],[5,9,6,9],[7,1,8,1],[7,9,8,9],[9,1,10,1],[9,9,10,9],[5,2,6,2],[7,2,8,2],[9,2,10,2],[0,3,0,8],[11,3,11,4],[11,5,11,6],[11,7,11,8],[2,3,2,8],[3,3,3,4],[3,5,3,6],[3,7,3,8],[4,3,4,4],[4,5,4,6],[4,7,4,8],[0,29,1,29],[14,29,15,29],[12,29,13,29],[6,29,7,29],[4,29,5,29],[8,29,9,29],[2,29,3,29],[10,29,11,29],[14,28,15,28],[25,17,25,18],[25,15,25,16],[25,19,25,20],[0,13,0,26],[15,13,15,26],[19,21,20,21],[19,22,24,22],[21,21,22,21],[23,21,24,21],[5,22,10,22],[5,21,6,21],[7,21,8,21],[9,21,10,21],[11,15,11,16],[11,17,11,18]]}
[null,null,null,"TESTER PLACEMENT",null,null,null,null,null,null,null,null,null,"TEST RESULT",null,null,null,null,null,null,null,null,null,null,null,null,null,null,"RULES","All board game rules apply but the setup, the tester placement and the test result is simulated through the steps below. Play only in the table \"Tester placement\". DO NOT LOOK IN THE SHEET \"SYSTEM BOARD\" DURING PLAY."]
[]
[null,null,null,"Test Tool",null,null,null,null,null,null,null,null,null,null,null,null,null,null,null,null,null,null,null,null,null,null,null,null,null,"Click to clear tables \"Tester placement\" and \"Test result\" so that a new game may be started. Players may place testers in turn order. No of testers depends on number of players."]
[null,null,null,null,null,null,null,null,null,null,null,null,null,null,null,"Module"]
[null,null,null,"A",null,"B",null,"C",null,null,null,null,null,null,null,"A",null,"B",null,"C",null,null,null,"Player","Tester","Score",null,null,null,"Place testers by entering player number in any of the 6 cells \"Analysis\". View analysis results by clicking the button and specifying analyzing player (without showing other players)."]
["Test Tool",null,1,null,null,null,null,null,null,1,null,"Analysis",null,"Tier",1,{"$f":"IF(D6=\"\",\"\",INDEX('System Board'!$C$5:$H$10,'System Board'!P9*2-1,'System Board'!P5*2-1))","v":""},{"$f":"IF(E6=\"\",\"\",INDEX('System Board'!$C$5:$H$10,'System Board'!P9*2-1,'System Board'!P5*2))","v":""},{"$f":"IF(F6=\"\",\"\",INDEX('System Board'!$C$5:$H$10,'System Board'!P9*2-1,'System Board'!P6*2-1))","v":""},{"$f":"IF(G6=\"\",\"\",INDEX('System Board'!$C$5:$H$10,'System Board'!P9*2-1,'System Board'!P6*2))","v":""},{"$f":"IF(H6=\"\",\"\",INDEX('System Board'!$C$5:$H$10,'System Board'!P9*2-1,'System Board'!P7*2-1))","v":""},{"$f":"IF(I6=\"\",\"\",INDEX('System Board'!$C$5:$H$10,'System Board'!P9*2-1,'System Board'!P7*2))","v":""},1,"Tier",1,{"$f":"COUNTIF(D$6:I$11,X6)+COUNTIF(D$4:I$4,X6)+COUNTIF(B$6:B$11,X6)+COUNTIF(K$6:K$11,X6)+COUNTIF(D$13:I$13,X6)","v":0},{"$f":"SUM('Score Board'!B2:G7)","v":0}]
[null,null,null,null,null,null,null,null,null,null,null,null,null,null,null,{"$f":"IF(D7=\"\",\"\",INDEX('System Board'!$C$5:$H$10,'System Board'!P9*2,'System Board'!P5*2-1))","v":""},{"$f":"IF(E7=\"\",\"\",INDEX('System Board'!$C$5:$H$10,'System Board'!P9*2,'System Board'!P5*2))","v":""},{"$f":"IF(F7=\"\",\"\",INDEX('System Board'!$C$5:$H$10,'System Board'!P9*2,'System Board'!P6*2-1))","v":""},{"$f":"IF(G7=\"\",\"\",INDEX('System Board'!$C$5:$H$10,'System Board'!P9*2,'System Board'!P6*2))","v":""},{"$f":"IF(H7=\"\",\"\",INDEX('System Board'!$C$5:$H$10,'System Board'!P9*2,'System Board'!P7*2-1))","v":""},{"$f":"IF(I7=\"\",\"\",INDEX('System Board'!$C$5:$H$10,'System Board'!P9*2,'System Board'!P7*2))","v":""},null,null,2,0,{"$f":"SUM('Score Board'!B12:G17)","v":0},null,null,"TEST","Place testers by entering player number in any of the 36 cells \"Tester placement\". View test results in table \"Test result\" (visible to all players)."]
[null,null,2,null,null,null,null,null,null,2,null,null,null,null,2,{"$f":"IF(D8=\"\",\"\",INDEX('System Board'!$C$5:$H$10,'System Board'!P10*2-1,'System Board'!P5*2-1))","v":""},{"$f":"IF(E8=\"\",\"\",INDEX('System Board'!$C$5:$H$10,'System Board'!P10*2-1,'System Board'!P5*2))","v":""},{"$f":"IF(F8=\"\",\"\",INDEX('System Board'!$C$5:$H$10,'System Board'!P10*2-1,'System Board'!P6*2-1))","v":""},{"$f":"IF(G8=\"\",\"\",INDEX('System Board'!$C$5:$H$10,'System Board'!P10*2-1,'System Board'!P6*2))","v":""},{"$f":"IF(H8=\"\",\"\",INDEX('System Board'!$C$5:$H$10,'System Board'!P10*2-1,'System Board'!P7*2-1))","v":""},{"$f":"IF(I8=\"\",\"\",INDEX('System Board'!$C$5:$H$10,'System Board'!P10*2-1,'System Board'!P7*2))","v":""},2,null,3,0,{"$f":"SUM('Score Board'!B22:G27)","v":0}]
[null,null,null,null,null,null,null,null,null,null,null,null,null,null,null,{"$f":"IF(D9=\"\",\"\",INDEX('System Board'!$C$5:$H$10,'System Board'!P10*2,'System Board'!P5*2-1))","v":""},{"$f":"IF(E9=\"\",\"\",INDEX('System Board'!$C$5:$H$10,'System Board'!P10*2,'System Board'!P5*2))","v":""},{"$f":"IF(F9=\"\",\"\",INDEX('System Board'!$C$5:$H$10,'System Board'!P10*2,'System Board'!P6*2-1))","v":""},{"$f":"IF(G9=\"\",\"\",INDEX('System Board'!$C$5:$H$10,'System Board'!P10*2,'System Board'!P6*2))","v":""},{"$f":"IF(H9=\"\",\"\",INDEX('System Board'!$C$5:$H$10,'System Board'!P10*2,'System Board'!P7*2-1))","v":""},{"$f":"IF(I9=\"\",\"\",INDEX('System Board'!$C$5:$H$10,'System Board'!P10*2,'System Board'!P7*2))","v":""},null,null,4,0,{"$f":"SUM('Score Board'!B32:G37)","v":0},null,null,"TEST TOOLS","Place testers by entering player number in any of the 6 cells \"Test tool\". Delete testers if additional bugs are found in the tier/module before retest (i.e. test tool effort is lost)."]
[null,null,3,null,null,null,null,null,null,3,null,null,null,null,3,{"$f":"IF(D10=\"\",\"\",INDEX('System Board'!$C$5:$H$10,'System Board'!P11*2-1,'System Board'!P5*2-1))","v":""},{"$f":"IF(E10=\"\",\"\",INDEX('System Board'!$C$5:$H$10,'System Board'!P11*2-1,'System Board'!P5*2))","v":""},{"$f":"IF(F10=\"\",\"\",INDEX('System Board'!$C$5:$H$10,'System Board'!P11*2-1,'System Board'!P6*2-1))","v":""},{"$f":"IF(G10=\"\",\"\",INDEX('System Board'!$C$5:$H$10,'System Board'!P11*2-1,'System Board'!P6*2))","v":""},{"$f":"IF(H10=\"\",\"\",INDEX('System Board'!$C$5:$H$10,'System Board'!P11*2-1,'System Board'!P7*2-1))","v":""},{"$f":"IF(I10=\"\",\"\",INDEX('System Board'!$C$5:$H$10,'System Board'!P11*2-1,'System Board'!P7*2))","v":""},3,null,5,0,{"$f":"SUM('Score Board'!B42:G47)","v":0}]
[null,null,null,null,null,null,null,null,null,null,null,null,null,null,null,{"$f":"IF(D11=\"\",\"\",INDEX('System Board'!$C$5:$H$10,'System Board'!P11*2,'System Board'!P5*2-1))","v":""},{"$f":"IF(E11=\"\",\"\",INDEX('System Board'!$C$5:$H$10,'System Board'!P11*2,'System Board'!P5*2))","v":""},{"$f":"IF(F11=\"\",\"\",INDEX('System Board'!$C$5:$H$10,'System Board'!P11*2,'System Board'!P6*2-1))","v":""},{"$f":"IF(G11=\"\",\"\",INDEX('System Board'!$C$5:$H$10,'System Board'!P11*2,'System Board'!P6*2))","v":""},{"$f":"IF(H11=\"\",\"\",INDEX('System Board'!$C$5:$H$10,'System Board'!P11*2,'System Board'!P7*2-1))","v":""},{"$f":"IF(I11=\"\",\"\",INDEX('System Board'!$C$5:$H$10,'System Board'!P11*2,'System Board'!P7*2))","v":""},null,null,6,0,{"$f":"SUM('Score Board'!B52:G57)","v":0},null,null,null,"Click to set all cells without testers to \"0\". Bugs not found during test are underlined in table \"Test result\"."]
[null,null,null,"A",null,"B",null,"C",null,null,null,null,null,null,null,"A",null,"B",null,"C",null,null,null,0,0,{"$f":"SUM('Score Board'!B62:G67)","v":0}]
[null,null,null,null,null,null,null,null,null,null,null,null,null,null,null,"Module",null,null,null,null,null,null,null,null,null,null,null,null,null,"Click to set retest results in table \"Retest result\"."]
[null,null,null,"Analysis"]
[null,null,null,null,null,null,null,null,null,null,null,null,null,null,null,null,null,null,null,null,null,null,null,null,null,null,null,null,"END","Check total score in table below or detailed score in sheet \"Score Board\"."]
{"$rows_left_out":13}
{"sheet":"Score Board","index":1,"n_rows":69,"n_cols":18,"rows_kept":69,"cut":false,"hidden":false,"merged":[[61,16,62,16],[31,16,32,16],[33,16,34,16],[35,16,36,16],[37,10,37,11],[37,12,37,13],[37,14,37,15],[38,10,38,15],[27,10,27,11],[27,12,27,13],[27,14,27,15],[28,10,28,15],[67,12,67,13],[67,14,67,15],[68,10,68,15],[47,10,47,11],[47,12,47,13],[47,14,47,15],[48,10,48,15],[7,10,7,11],[7,12,7,13],[7,14,7,15],[8,10,8,15],[57,10,57,11],[57,12,57,13],[57,14,57,15],[58,10,58,15],[18,10,18,15],[11,17,16,17],[1,17,6,17],[41,16,42,16],[43,16,44,16],[45,16,46,16],[51,16,52,16],[53,16,54,16],[55,16,56,16],[1,16,2,16],[3,16,4,16],[5,16,6,16],[11,16,12,16],[13,16,14,16],[15,16,16,16],[21,16,22,16],[23,16,24,16],[25,16,26,16],[21,17,26,17],[31,17,36,17],[61,17,66,17],[51,17,56,17],[41,17,46,17],[68,1,68,6],[61,7,62,7],[61,8,66,8],[63,7,64,7],[65,7,66,7],[67,1,67,2],[67,3,67,4],[67,5,67,6],[41,8,46,8],[57,1,57,2],[57,3,57,4],[57,5,57,6],[51,7,52,7],[51,8,56,8],[58,1,58,6],[41,7,42,7],[63,16,64,16],[65,16,66,16],[67,10,67,11],[43,7,44,7],[45,7,46,7],[31,8,36,8],[33,7,34,7],[35,7,36,7],[37,1,37,2],[37,3,37,4],[37,5,37,6],[17,10,17,11],[17,12,17,13],[17,14,17,15],[17,1,17,2],[17,3,17,4],[17,5,17,6],[21,7,22,7],[21,8,26,8],[23,7,24,7],[25,7,26,7],[27,1,27,2],[27,3,27,4],[27,5,27,6],[47,1,47,2],[47,3,47,4],[53,7,54,7],[55,7,56,7],[31,7,32,7],[28,1,28,6],[38,1,38,6],[48,1,48,6],[47,5,47,6],[1,7,2,7],[1,8,6,8],[3,7,4,7],[5,7,6,7],[7,1,7,2],[7,3,7,4],[7,5,7,6],[8,1,8,6],[18,1,18,6],[11,7,12,7],[11,8,16,8],[13,7,14,7],[15,7,16,7]]}
[null,"Player",1,null,null,null,null,null,null,null,"Player",1]
[null,{"$f":"IF('Game Board'!D6=$C$1,OFFSET('Game Board'!D6,0,12),\"\")","v":""},{"$f":"IF('Game Board'!E6=$C$1,OFFSET('Game Board'!E6,0,12),\"\")","v":""},{"$f":"IF('Game Board'!F6=$C$1,OFFSET('Game Board'!F6,0,12),\"\")","v":""},{"$f":"IF('Game Board'!G6=$C$1,OFFSET('Game Board'!G6,0,12),\"\")","v":""},{"$f":"IF('Game Board'!H6=$C$1,OFFSET('Game Board'!H6,0,12),\"\")","v":""},{"$f":"IF('Game Board'!I6=$C$1,OFFSET('Game Board'!I6,0,12),\"\")","v":""},1,"Tier",null,{"$f":"IF(OR(AND('Game Board'!$B6=$L$1,'Game Board'!D$4=$L$1),AND('Game Board'!$B6=$L$1,'Game Board'!D$4=0),AND('Game Board'!$B6=0,'Game Board'!D$4=$L$1)),'Game Board'!P20,IF(OR('Game Board'!$B6=$L$1,'Game Board'!D$4=$L$1),'Game Board'!P20/2,\"\"))","v":""},null,{"$f":"IF(OR(AND('Game Board'!$B6=$L$1,'Game Board'!F$4=$L$1),AND('Game Board'!$B6=$L$1,'Game Board'!F$4=0),AND('Game Board'!$B6=0,'Game Board'!F$4=$L$1)),'Game Board'!R20,IF(OR('Game Board'!$B6=$L$1,'Game Board'!F$4=$L$1),'Game Board'!R20/2,\"\"))","v":""},null,{"$f":"IF(OR(AND('Game Board'!$B6=$L$1,'Game Board'!H$4=$L$1),AND('Game Board'!$B6=$L$1,'Game Board'!H$4=0),AND('Game Board'!$B6=0,'Game Board'!H$4=$L$1)),'Game Board'!T20,IF(OR('Game Board'!$B6=$L$1,'Game Board'!H$4=$L$1),'Game Board'!T20/2,\"\"))","v":""},null,1,"Tier"]
[null,{"$f":"IF('Game Board'!D7=$C$1,OFFSET('Game Board'!D7,0,12),\"\")","v":""},{"$f":"IF('Game Board'!E7=$C$1,OFFSET('Game Board'!E7,0,12),\"\")","v":""},{"$f":"IF('Game Board'!F7=$C$1,OFFSET('Game Board'!F7,0,12),\"\")","v":""},{"$f":"IF('Game Board'!G7=$C$1,OFFSET('Game Board'!G7,0,12),\"\")","v":""},{"$f":"IF('Game Board'!H7=$C$1,OFFSET('Game Board'!H7,0,12),\"\")","v":""},{"$f":"IF('Game Board'!I7=$C$1,OFFSET('Game Board'!I7,0,12),\"\")","v":""}]
[null,{"$f":"IF('Game Board'!D8=$C$1,OFFSET('Game Board'!D8,0,12),\"\")","v":""},{"$f":"IF('Game Board'!E8=$C$1,OFFSET('Game Board'!E8,0,12),\"\")","v":""},{"$f":"IF('Game Board'!F8=$C$1,OFFSET('Game Board'!F8,0,12),\"\")","v":""},{"$f":"IF('Game Board'!G8=$C$1,OFFSET('Game Board'!G8,0,12),\"\")","v":""},{"$f":"IF('Game Board'!H8=$C$1,OFFSET('Game Board'!H8,0,12),\"\")","v":""},{"$f":"IF('Game Board'!I8=$C$1,OFFSET('Game Board'!I8,0,12),\"\")","v":""},2,null,null,{"$f":"IF(OR(AND('Game Board'!$B8=$L$1,'Game Board'!D$4=$L$1),AND('Game Board'!$B8=$L$1,'Game Board'!D$4=0),AND('Game Board'!$B8=0,'Game Board'!D$4=$L$1)),'Game Board'!P22,IF(OR('Game Board'!$B8=$L$1,'Game Board'!D$4=$L$1),'Game Board'!P22/2,\"\"))","v":""},null,{"$f":"IF(OR(AND('Game Board'!$B8=$L$1,'Game Board'!F$4=$L$1),AND('Game Board'!$B8=$L$1,'Game Board'!F$4=0),AND('Game Board'!$B8=0,'Game Board'!F$4=$L$1)),'Game Board'!R22,IF(OR('Game Board'!$B8=$L$1,'Game Board'!F$4=$L$1),'Game Board'!R22/2,\"\"))","v":""},null,{"$f":"IF(OR(AND('Game Board'!$B8=$L$1,'Game Board'!H$4=$L$1),AND('Game Board'!$B8=$L$1,'Game Board'!H$4=0),AND('Game Board'!$B8=0,'Game Board'!H$4=$L$1)),'Game Board'!T22,IF(OR('Game Board'!$B8=$L$1,'Game Board'!H$4=$L$1),'Game Board'!T22/2,\"\"))","v":""},null,2]
[null,{"$f":"IF('Game Board'!D9=$C$1,OFFSET('Game Board'!D9,0,12),\"\")","v":""},{"$f":"IF('Game Board'!E9=$C$1,OFFSET('Game Board'!E9,0,12),\"\")","v":""},{"$f":"IF('Game Board'!F9=$C$1,OFFSET('Game Board'!F9,0,12),\"\")","v":""},{"$f":"IF('Game Board'!G9=$C$1,OFFSET('Game Board'!G9,0,12),\"\")","v":""},{"$f":"IF('Game Board'!H9=$C$1,OFFSET('Game Board'!H9,0,12),\"\")","v":""},{"$f":"IF('Game Board'!I9=$C$1,OFFSET('Game Board'!I9,0,12),\"\")","v":""}]
[null,{"$f":"IF('Game Board'!D10=$C$1,OFFSET('Game Board'!D10,0,12),\"\")","v":""},{"$f":"IF('Game Board'!E10=$C$1,OFFSET('Game Board'!E10,0,12),\"\")","v":""},{"$f":"IF('Game Board'!F10=$C$1,OFFSET('Game Board'!F10,0,12),\"\")","v":""},{"$f":"IF('Game Board'!G10=$C$1,OFFSET('Game Board'!G10,0,12),\"\")","v":""},{"$f":"IF('Game Board'!H10=$C$1,OFFSET('Game Board'!H10,0,12),\"\")","v":""},{"$f":"IF('Game Board'!I10=$C$1,OFFSET('Game Board'!I10,0,12),\"\")","v":""},3,null,null,{"$f":"IF(OR(AND('Game Board'!$B10=$L$1,'Game Board'!D$4=$L$1),AND('Game Board'!$B10=$L$1,'Game Board'!D$4=0),AND('Game Board'!$B10=0,'Game Board'!D$4=$L$1)),'Game Board'!P24,IF(OR('Game Board'!$B10=$L$1,'Game Board'!D$4=$L$1),'Game Board'!P24/2,\"\"))","v":""},null,{"$f":"IF(OR(AND('Game Board'!$B10=$L$1,'Game Board'!F$4=$L$1),AND('Game Board'!$B10=$L$1,'Game Board'!F$4=0),AND('Game Board'!$B10=0,'Game Board'!F$4=$L$1)),'Game Board'!R24,IF(OR('Game Board'!$B10=$L$1,'Game Board'!F$4=$L$1),'Game Board'!R24/2,\"\"))","v":""},null,{"$f":"IF(OR(AND('Game Board'!$B10=$L$1,'Game Board'!H$4=$L$1),AND('Game Board'!$B10=$L$1,'Game Board'!H$4=0),AND('Game Board'!$B10=0,'Game Board'!H$4=$L$1)),'Game Board'!T24,IF(OR('Game Board'!$B10=$L$1,'Game Board'!H$4=$L$1),'Game Board'!T24/2,\"\"))","v":""},null,3]
[null,{"$f":"IF('Game Board'!D11=$C$1,OFFSET('Game Board'!D11,0,12),\"\")","v":""},{"$f":"IF('Game Board'!E11=$C$1,OFFSET('Game Board'!E11,0,12),\"\")","v":""},{"$f":"IF('Game Board'!F11=$C$1,OFFSET('Game Board'!F11,0,12),\"\")","v":""},{"$f":"IF('Game Board'!G11=$C$1,OFFSET('Game Board'!G11,0,12),\"\")","v":""},{"$f":"IF('Game Board'!H11=$C$1,OFFSET('Game Board'!H11,0,12),\"\")","v":""},{"$f":"IF('Game Board'!I11=$C$1,OFFSET('Game Board'!I11,0,12),\"\")","v":""}]
[null,"A",null,"B",null,"C",null,null,null,null,"A",null,"B",null,"C"]
[null,"Module",null,null,null,null,null,null,null,null,"Module"]
[]
[null,"Player",2,null,null,null,null,null,null,null,"Player",2]
[null,{"$f":"IF('Game Board'!D6=$C$11,OFFSET('Game Board'!D6,0,12),\"\")","v":""},{"$f":"IF('Game Board'!E6=$C$11,OFFSET('Game Board'!E6,0,12),\"\")","v":""},{"$f":"IF('Game Board'!F6=$C$11,OFFSET('Game Board'!F6,0,12),\"\")","v":""},{"$f":"IF('Game Board'!G6=$C$11,OFFSET('Game Board'!G6,0,12),\"\")","v":""},{"$f":"IF('Game Board'!H6=$C$11,OFFSET('Game Board'!H6,0,12),\"\")","v":""},{"$f":"IF('Game Board'!I6=$C$11,OFFSET('Game Board'!I6,0,12),\"\")","v":""},1,"Tier",null,{"$f":"IF(OR(AND('Game Board'!$B6=$L$11,'Game Board'!D$4=$L$11),AND('Game Board'!$B6=$L$11,'Game Board'!D$4=0),AND('Game Board'!$B6=0,'Game Board'!D$4=$L$11)),'Game Board'!P20,IF(OR('Game Board'!$B6=$L$11,'Game Board'!D$4=$L$11),'Game Board'!P20/2,\"\"))","v":""},null,{"$f":"IF(OR(AND('Game Board'!$B6=$L$11,'Game Board'!F$4=$L$11),AND('Game Board'!$B6=$L$11,'Game Board'!F$4=0),AND('Game Board'!$B6=0,'Game Board'!F$4=$L$11)),'Game Board'!R20,IF(OR('Game Board'!$B6=$L$11,'Game Board'!F$4=$L$11),'Game Board'!R20/2,\"\"))","v":""},null,{"$f":"IF(OR(AND('Game Board'!$B6=$L$11,'Game Board'!H$4=$L$11),AND('Game Board'!$B6=$L$11,'Game Board'!H$4=0),AND('Game Board'!$B6=0,'Game Board'!H$4=$L$11)),'Game Board'!T20,IF(OR('Game Board'!$B6=$L$11,'Game Board'!H$4=$L$11),'Game Board'!T20/2,\"\"))","v":""},null,1,"Tier"]
[null,{"$f":"IF('Game Board'!D7=$C$11,OFFSET('Game Board'!D7,0,12),\"\")","v":""},{"$f":"IF('Game Board'!E7=$C$11,OFFSET('Game Board'!E7,0,12),\"\")","v":""},{"$f":"IF('Game Board'!F7=$C$11,OFFSET('Game Board'!F7,0,12),\"\")","v":""},{"$f":"IF('Game Board'!G7=$C$11,OFFSET('Game Board'!G7,0,12),\"\")","v":""},{"$f":"IF('Game Board'!H7=$C$11,OFFSET('Game Board'!H7,0,12),\"\")","v":""},{"$f":"IF('Game Board'!I7=$C$11,OFFSET('Game Board'!I7,0,12),\"\")","v":""}]
[null,{"$f":"IF('Game Board'!D8=$C$11,OFFSET('Game Board'!D8,0,12),\"\")","v":""},{"$f":"IF('Game Board'!E8=$C$11,OFFSET('Game Board'!E8,0,12),\"\")","v":""},{"$f":"IF('Game Board'!F8=$C$11,OFFSET('Game Board'!F8,0,12),\"\")","v":""},{"$f":"IF('Game Board'!G8=$C$11,OFFSET('Game Board'!G8,0,12),\"\")","v":""},{"$f":"IF('Game Board'!H8=$C$11,OFFSET('Game Board'!H8,0,12),\"\")","v":""},{"$f":"IF('Game Board'!I8=$C$11,OFFSET('Game Board'!I8,0,12),\"\")","v":""},2,null,null,{"$f":"IF(OR(AND('Game Board'!$B8=$L$11,'Game Board'!D$4=$L$11),AND('Game Board'!$B8=$L$11,'Game Board'!D$4=0),AND('Game Board'!$B8=0,'Game Board'!D$4=$L$11)),'Game Board'!P22,IF(OR('Game Board'!$B8=$L$11,'Game Board'!D$4=$L$11),'Game Board'!P22/2,\"\"))","v":""},null,{"$f":"IF(OR(AND('Game Board'!$B8=$L$11,'Game Board'!F$4=$L$11),AND('Game Board'!$B8=$L$11,'Game Board'!F$4=0),AND('Game Board'!$B8=0,'Game Board'!F$4=$L$11)),'Game Board'!R22,IF(OR('Game Board'!$B8=$L$11,'Game Board'!F$4=$L$11),'Game Board'!R22/2,\"\"))","v":""},null,{"$f":"IF(OR(AND('Game Board'!$B8=$L$11,'Game Board'!H$4=$L$11),AND('Game Board'!$B8=$L$11,'Game Board'!H$4=0),AND('Game Board'!$B8=0,'Game Board'!H$4=$L$11)),'Game Board'!T22,IF(OR('Game Board'!$B8=$L$11,'Game Board'!H$4=$L$11),'Game Board'!T22/2,\"\"))","v":""},null,2]
[null,{"$f":"IF('Game Board'!D9=$C$11,OFFSET('Game Board'!D9,0,12),\"\")","v":""},{"$f":"IF('Game Board'!E9=$C$11,OFFSET('Game Board'!E9,0,12),\"\")","v":""},{"$f":"IF('Game Board'!F9=$C$11,OFFSET('Game Board'!F9,0,12),\"\")","v":""},{"$f":"IF('Game Board'!G9=$C$11,OFFSET('Game Board'!G9,0,12),\"\")","v":""},{"$f":"IF('Game Board'!H9=$C$11,OFFSET('Game Board'!H9,0,12),\"\")","v":""},{"$f":"IF('Game Board'!I9=$C$11,OFFSET('Game Board'!I9,0,12),\"\")","v":""}]
{"$rows_left_out":55}
{"sheet":"System Board","index":2,"n_rows":25,"n_cols":25,"rows_kept":25,"cut":false,"hidden":false,"merged":[[23,2,23,3],[23,4,23,5],[23,6,23,7],[24,2,24,7],[17,0,22,0],[17,1,18,1],[17,8,18,8],[17,9,22,9],[19,1,20,1],[19,8,20,8],[21,1,22,1],[21,8,22,8],[2,2,2,7],[4,8,5,8],[4,9,9,9],[6,8,7,8],[8,8,9,8],[15,2,15,7],[16,2,16,3],[16,4,16,5],[16,6,16,7],[4,0,9,0],[4,1,5,1],[6,1,7,1],[8,1,9,1],[13,0,13,15],[11,2,11,7],[3,2,3,3],[3,4,3,5],[3,6,3,7],[10,2,10,3],[10,4,10,5],[10,6,10,7],[0,21,0,23],[0,18,0,20],[0,17,1,17],[0,24,1,24],[0,0,0,15]]}
["GAME SETUP - TEST PHASE",null,null,null,null,null,null,null,null,null,null,null,null,null,null,null,null,"Component","Business criticality",null,null,"Technical complexity",null,null,"Random"]
[null,null,null,null,null,null,null,null,null,null,null,null,null,null,null,null,null,null,1,2,3,1,2,3]
[null,null,"Business criticality",null,null,null,null,null,null,null,null,null,null,null,null,null,null,1,1,0,0,0,0,1,{"$f":"RAND()","v":0.46499347030073512}]
[null,null,1,null,2,null,3,null,null,null,null,"Business criticality","Module","Random","Module","Business criticality",null,2,0,0,0,0,0,0,{"$f":"RAND()","v":0.30224906676377716}]
["Technical complexity",1,{"$f":"$V$3*$S$3","v":0},{"$f":"$V$4*$S$4","v":0},{"$f":"$V$7*$T$3","v":0},{"$f":"$V$8*$T$4","v":0},{"$f":"$V$11*$U$3","v":0},{"$f":"$V$12*$U$4","v":0},{"$f":"VLOOKUP(1,L$9:M$11,2,FALSE)","v":3},"Tier",null,1,"A",{"$f":"RAND()","v":0.58463642417445127},"A",{"$f":"SUMIF(M$5:M$7,O5,L$5:L$7)","v":1},null,3,0,0,1,1,1,1,{"$f":"RAND()","v":0.94264781434110412}]
[null,null,{"$f":"$V$5*$S$5","v":0},{"$f":"$V$6*$S$6","v":0},{"$f":"$V$9*$T$5","v":0},{"$f":"$V$10*$T$6","v":0},{"$f":"$V$13*$U$5","v":0},{"$f":"$V$14*$U$6","v":0},null,null,null,2,"B",{"$f":"RAND()","v":0.69664366493545193},"B",{"$f":"SUMIF(M$5:M$7,O6,L$5:L$7)","v":2},null,4,0,2,0,0,0,0,{"$f":"RAND()","v":0.14361014413826523}]
[null,2,{"$f":"$W$3*$S$7","v":0},{"$f":"$W$4*$S$8","v":0},{"$f":"$W$7*$T$7","v":1},{"$f":"$W$8*$T$8","v":0},{"$f":"$W$11*$U$7","v":0},{"$f":"$W$12*$U$8","v":0},{"$f":"VLOOKUP(2,L$9:M$11,2,FALSE)","v":1},null,null,3,"C",{"$f":"RAND()","v":0.14734578515255525},"C",{"$f":"SUMIF(M$5:M$7,O7,L$5:L$7)","v":3},null,5,0,1,1,0,1,1,{"$f":"RAND()","v":0.93423331328201942}]
[null,null,{"$f":"$W$5*$S$9","v":1},{"$f":"$W$6*$S$10","v":0},{"$f":"$W$9*$T$9","v":0},{"$f":"$W$10*$T$10","v":0},{"$f":"$W$13*$U$9","v":2},{"$f":"$W$14*$U$10","v":0},null,null,null,"Technical complexity","Tier","Random","Tier","Technical complexity",null,6,0,1,0,0,0,0,{"$f":"RAND()","v":0.31680939783828876}]
[null,3,{"$f":"$X$3*$S$11","v":2},{"$f":"$X$4*$S$12","v":0},{"$f":"$X$7*$T$11","v":3},{"$f":"$X$8*$T$12","v":0},{"$f":"$X$11*$U$11","v":3},{"$f":"$X$12*$U$12","v":0},{"$f":"VLOOKUP(3,L$9:M$11,2,FALSE)","v":2},null,null,1,3,{"$f":"RAND()","v":0.84618009066759925},1,{"$f":"SUMIF(M$9:M$11,O9,L$9:L$11)","v":2},null,7,1,0,2,1,1,1,{"$f":"RAND()","v":0.29953435532953887}]
[null,null,{"$f":"$X$5*$S$13","v":0},{"$f":"$X$6*$S$14","v":0},{"$f":"$X$9*$T$13","v":0},{"$f":"$X$10*$T$14","v":0},{"$f":"$X$13*$U$13","v":0},{"$f":"$X$14*$U$14","v":2},null,null,null,2,1,{"$f":"RAND()","v":0.72246006338027102},2,{"$f":"SUMIF(M$9:M$11,O10,L$9:L$11)","v":3},null,8,0,0,0,0,0,1,{"$f":"RAND()","v":0.40789729385882034}]
[null,null,{"$f":"VLOOKUP(1,$L5:$M7,2,FALSE)","v":"A"},null,{"$f":"VLOOKUP(2,$L5:$M7,2,FALSE)","v":"B"},null,{"$f":"VLOOKUP(3,$L5:$M7,2,FALSE)","v":"C"},null,null,null,null,3,2,{"$f":"RAND()","v":0.23954185323511867},3,{"$f":"SUMIF(M$9:M$11,O11,L$9:L$11)","v":1},null,9,2,3,3,0,0,1,{"$f":"RAND()","v":0.17439544628089942}]
[null,null,"Module",null,null,null,null,null,null,null,null,null,null,null,null,null,null,10,0,-1,0,0,1,1,{"$f":"RAND()","v":0.61693074819531146}]
[null,null,null,null,null,null,null,null,null,null,null,null,null,null,null,null,null,11,0,0,0,0,1,1,{"$f":"RAND()","v":0.45440404136343171}]
["GAME SETUP - RETEST PHASE",null,null,null,null,null,null,null,null,null,null,null,null,null,null,null,null,12,-1,0,2,1,1,1,{"$f":"RAND()","v":0.64043633074362905}]
[null,null,null,null,null,null,null,null,null,null,null,null,null,null,null,null,null,null,{"$f":"SUM(S3:S14)","v":3},6,9,3,6,9]
{"$rows_left_out":10}